{"text_format":"1","workbook":"xlsx","n_sheets":9,"sheets":["Cover","Valuation Framework","Dashboard","Deferral Value Calculation","Bridge to Wires Calculation","EJ Impacts Calculation","ICE Calculator Results","Reference Utility Data","Mappings"],"not_rendered":{"charts":4,"images":9,"macros":1,"external_links":0,"defined_names":40,"comments":0,"pivot_tables":0},"unopened":[],"bounds":{"document_bytes":16777216,"sheet_cells":100000,"rows_first":2000,"rows_last":500,"rows_between":2000,"halvings":0,"cell_chars":16384,"cell_head_chars":4096},"cells_cut":0,"cells_raw":0,"read":"whole","date_system":"1900"}

{"sheet":"Cover","index":0,"n_rows":48,"n_cols":3,"rows_kept":48,"cut":false,"hidden":false,"merged":[]}
["Grid Services Valuation Model"]
[]
[]
[null,"Prepared for","Prepared by"]
[]
[]
[]
[]
[]
[]
[null,"September 2025"]
[]
[null,"Instructions"]
[]
[null,"View the Valuation Calculator Tool training on the Grid Services Study website."]
[null,"Start with the green tabs and work through each blue calculation tab, entering user inputs."]
[null,"Review each blue calculation tab to understand how each value streams are calculated."]
[null,"Explore the \"Dashboard\" tab to understand how the selected value streams inform an example compensation structure."]
[]
[]
[null,"Table of Contents"]
[]
[]
[null,"Sheet","Description"]
[null,"Valuation Framework","Diagram of the valuation framework to illustrate how each value stream flows into the compensation."]
[null,"Dashboard","Dashboard for User Inputs and Compensation calculations. Valuation user inputs for project-specific data applicable to all valuation calculations. Compensation user inputs to determine customer compensation levels, which are provided as an output in this tab."]
[null,"Deferral Value Calculation","Calculations for Deferral Value. Deferral Value reflects benefits of delaying investments related to the time value of money."]
[null,"Bridge to Wires Calculation","Calculations for Bridge to Wires Value. Bridge-to-Wires solutions are designed to bridge the gap between an imminent capacity constraint and the time it takes to complete construction of a traditional infrastructure solution."]
[null,"EJ Impacts Calculation","Calculations for Environmental Justice Value. Environmental Justice values include an EJ Participant adder to encourage participation by EJ customers and an Air Quality adder to value the benefits of reducing air pollution from backup diesel generation in EJ-designated communities."]
[null,"ICE Calculator Results","Results from DOE's Interruptible Cost Estimate calculator applied to Bridge to Wires calculation."]
[null,"Reference Utility Data","Utility-specific data that is  applied in the valuation calculations."]
[null,"Mappings","Dropdown input selections"]
[null,"*Optionality Value is calculated in a separate model and will not feed into the compensation calculation in the pilot Grid Services offerings."]
[]
[null,"Cell Style Legend"]
[]
[null,"Cells in this Valuation Model are color-coded to indicate intent:"]
[]
[null,"User Inputs"]
[null,"Dropdown User Inputs"]
{"$rows_left_out":9}
{"sheet":"Valuation Framework","index":1,"n_rows":43,"n_cols":6,"rows_kept":43,"cut":false,"hidden":false,"merged":[[42,5,43,14]]}
[]
[]
[]
[null,"Valuation Framework"]
[]
[null,"Rate Impact value streams provide the primary basis for determining valuing grid services and establishing baseline compensation"]
[null,"Separate EJ Participant and Air Quality Adders may be considered in compensation design to further support EJ participation or benefits"]
[]
[]
[]
[]
[]
[]
[]
[]
[]
[]
[]
[]
[]
[]
[]
[]
[]
[]
[]
[]
[]
[]
[]
[]
[]
[]
[]
[]
[]
[]
[]
[]
[]
{"$rows_left_out":4}
{"sheet":"Dashboard","index":2,"n_rows":65,"n_cols":31,"rows_kept":65,"cut":false,"hidden":false,"merged":[[34,1,34,11],[32,4,32,16]]}
[]
[]
[]
[null,"Valuation User Inputs"]
[]
[null,"Project-Specific Planning Inputs",null,"Explanation"]
[null,"In-Service Date of Planned Upgrade (by Jan 1)",2032,"Planned in-service year for a traditional asset upgrade if no deferral solution is implemented. A non-blank user input overrides use of the specified load forecast and capacity limit"]
[null,"Adjusted Plant-in-service Year (by Jan 1)",2035,"The new required in-service year for the traditional asset upgrade once a deferral solution has been implemented. A non-blank user input overrides use of the specified load forecast and capacity limit plus DER impact"]
[null,"Years of Deferral",3]
[]
[null,"Capacity Need for Load Relief (MW)",2025,2026,2027,2028,2029,2030,2031,2032,2033,2034,2035,2036,2037,2038,2039,2040,2041,2042,2043,2044,2045,2046,2047,2048,2049,2050]
[null,"Annual Capacity Need",null,null,null,null,null,null,null,1.4343285985331846,4.8101373902930504,8.2703414018469061]
[null,"Forecasted capacity need at deferral or bridge-to-wires project location"]
[]
[]
[null,"Example - Grid Services Compensation User Inputs & Calculations"]
[]
[null,"The compensation user inputs and calculations take the outputs from the valuation calculation to determine what the total compensation for DERs would be for the example location."]
[]
[null,"Compensation Structure Inputs",null,"Explanation"]
[null,"Capacity Constraint Scenario","Deferral","Is this a deferral or bridge-to-wires solution?"]
[null,"EJ Customer Participation (% of Capacity)",0.12,"How much capacity is enrolled to EJ customers? -- EJ participation adder will apply to these participants for Deferral and Bridge-to-Wires solutions"]
[null,"Localized EJ Impact","Yes","Is the project in an Air Quality district? -- If yes, localized EJ impact adder will be applied to Bridge-to-Wires solutions"]
[null,"Reservation Payment","Yes","Would you like to provide a reservation payment, i.e., a payment for years before the solution's capacity is needed? In this example, the reservation payment stops when activation payment begins. In practice, structures may vary"]
[null,"Reservation % of Total Value",0.1,"Used to set a theoretical reservation payment as a % of the total compensation."]
[null,"Reservation Payment Start Year",2027,"Must be before \"Adjusted plant-in-service start year\""]
[null,"Enrollment Reserve Margin",0.25,"How much more capacity should be enrolled over the capacity need? This input is only applied within the Compensation Calculation"]
[]
[null,"Total Compensation","Guideline Ceiling","User Input Compensation"]
[null,"Total Grid Service Compensation Available",{"$f":"_xlfn.IFS($C$21=\"Deferral\",'Deferral Value Calculation'!$C$62,$C$21=\"Bridge-to-Wires\",(('Bridge to Wires Calculation'!$E$57+IF($C$23=\"Yes\",'EJ Impacts Calculation'!$E$25))*MIN(IF(Dashboard!$D$12:$AC$12>0, Dashboard!$D$12:$AC$12))*1000))","v":4176884.5755459666},{"$f":"SUM(D31:D32)","v":1253065.3726637899}]
[null,"Value allocated to all non-EJ Participants (Total $)",{"$f":"C30-C32","v":3589510.1821098151},{"$f":"D33*(MAX(Dashboard!$C$12:$AB$12)*(1+$C$27)*Dashboard!$C$9*1000)*(1-$C$22)","v":1076853.0546329445}]
[null,"Value allocated to all EJ Participants (Total $)",{"$f":"C30/(1+(1-C22)/((1+'EJ Impacts Calculation'!$E$8)*C22))","v":587374.39343615156},{"$f":"D34*(MAX(Dashboard!$C$12:$AB$12)*(1+$C$27)*Dashboard!$C$9*1000)*$C$22","v":176212.31803084546}]
[null,"Baseline (Non-EJ Participant) Incentive ($/kW-yr)",{"$f":"C31/(MAX(Dashboard!$C$12:$AB$12)*(1+$C$27)*(1-$C$22)*Dashboard!$C$9*1000)","v":131.52182060733153},{"$f":"C33*0.3","v":39.45654618219946},"User should input a value in the yellow cell which is between zero and the Guideline Ceiling for the Baseline incentive, less any expected costs for program administration. This will form the present value basis for compensation. The actual dollar value issued in individual years will vary from this input due to discounting and any reservation payments."]
[null,"EJ Participant Incentive ($/kW-yr)",{"$f":"C33*(1+'EJ Impacts Calculation'!$E$8)","v":157.82618472879784},{"$f":"D33*(1+'EJ Impacts Calculation'!$E$8)","v":47.347855418639348},"Calculated as the Baseline Incentive * (1 + EJ Participant adder).  Incentives shown in this table do not account for enrollment reserve margins"]
[null,"The guideline ceiling is to be regarded as an upper bound and is based on the value provided to the distribution grid, adjusted for EJ adders. To avoid a cost shift, actual compensation must be lower than this value, minus program and sunk costs.\nCost shifts may still occur if the Value of Lost Load is applied in B2W scenarios and the guideline ceiling is used"]
[]
[null,"Net Benefit Shared with Ratepayers"]
[null,"Total $",{"$f":"C30-D30","v":2923819.2028821767},"This core output value (less costs of administration) reflects the net benefit that DER grid services would be providing to ratepayers"]
[null,"High positive values put downward pressure on rates. Low or negative values would indicate that ratepayers are subsidizing the program (when factoring in additional program administration or sunk costs)"]
[]
{"$rows_left_out":26}
{"sheet":"Deferral Value Calculation","index":3,"n_rows":93,"n_cols":63,"rows_kept":93,"cut":false,"hidden":false,"merged":[[41,1,41,5],[5,1,5,5],[92,1,93,5]]}
[]
[]
[null,"Deferral Value Stream"]
[]
[]
[null,"Deferral Value reflects benefits of delaying investments related to the time value of money."]
[]
[]
[]
[]
[]
[]
[]
[]
[]
[]
[]
[]
[]
[]
[]
[]
[]
[]
[]
[]
[]
[]
[]
[]
[]
[]
[]
[]
[]
[]
[]
[]
[]
[null,"Deferral Value Calculation"]
{"$rows_left_out":54}
{"sheet":"Bridge to Wires Calculation","index":4,"n_rows":136,"n_cols":26,"rows_kept":136,"cut":false,"hidden":false,"merged":[[5,1,6,5],[114,2,114,3],[41,3,41,7],[80,2,80,3],[91,2,91,3],[97,2,97,3],[49,2,49,4],[53,2,53,4]]}
[]
[]
[null,"Bridge-to-Wires Solution"]
[]
[]
[null,"Bridge-to-Wires solutions are designed to bridge the gap between an imminent capacity constraint and the time it takes to complete construction of a traditional infrastructure solution."]
[]
[]
[]
[]
[]
[]
[]
[]
[]
[]
[]
[]
[]
[]
[]
[]
[]
[]
[]
[]
[]
[]
[]
[]
[]
[]
[]
[]
[]
[]
[]
[]
[]
[null,"Bridge-to-Wires Value Stream Calculation"]
{"$rows_left_out":97}
{"sheet":"EJ Impacts Calculation","index":5,"n_rows":56,"n_cols":8,"rows_kept":56,"cut":false,"hidden":false,"merged":[[6,2,6,3],[18,2,18,3],[24,2,24,3],[11,2,11,3],[17,2,17,3]]}
[]
[]
[null,"Environmental Justice - Non-Rate Impact Value Streams"]
[]
[]
[null,"EJ Participant Adder",null,null,null,null,"Explanation"]
[null,1,"EJ Participant adder",null,null,null,"Percent adder applied on top of the base Deferral or Bridge to Wires value to increase compensation for qualified Environmental Justice participants"]
[null,2,null,"EJ Participant Adder (%)",0.2,null,"e.g. an adder of 20% would mean that qualified EJ participants receive 120% of the base compensation selected for a given location"]
[null,null,null,null,null,null,"The initial default value of 20% is based on a review of similar or low-income participant adders in other jurisdictions. Please refer to the report for more detail"]
[]
[null,"Air Quality Adder*",null,null,null,"Reference","Explanation"]
[null,"1a","Air quality impacts of diesel generation"]
[null,"2a",null,"Diesel emissions factor","Uncontrolled Diesel Industrial Engines",null,"Selection of diesel engine type used for emissions factors"]
[null,"3a",null,"Air quality health impacts ($/kWh)",{"$f":"_xlfn.IFS($E$13=\"Uncontrolled Diesel Industrial Engines\", $G$39, $E$13=\"Large Stationary Diesel Engines\", $G$54)","v":0.49801099999999998},"COBRA output","Calculated below from COBRA depending on emission factor source; uses High value from COBRA calculator"]
[null,"4a",null,"Hours of usage per year (hours)",{"$f":"8*30","v":240},null,"Assumes 8 hrs* 30 days/yr "]
[null,"5a",null,"Probability of Backup Solution being Deployed (without use of DERs)",{"$f":"IF('Bridge to Wires Calculation'!$E$47 = Mappings!$F$5, 1, IF('Bridge to Wires Calculation'!$E$47= Mappings!$F$4, 'Bridge to Wires Calculation'!$E$55,0))","v":0.9},null,"If weighted average is selected for the Bridge to Wires Calculation, this uses the user-input weighting. Otherwise applies 100% to the selected counterfactual backup"]
[null,"6a",null,"Diesel generation air quality value ($/kW-yr)",{"$f":"E14*E15*E16","v":107.570376}," [3a] * [4a]* [5a]"]
[]
[null,"1b","Air quality impacts of battery storage"]
[null,"2b",null,"Air quality health impacts ($/kWh)",0,null,"Predetermined assumption that avoiding storage provides no air quality impact"]
[null,"3b",null,"Hours of usage per year (hours)",{"$f":"E15","v":240},null,{"$f":"G15","v":"Assumes 8 hrs* 30 days/yr "}]
[null,"4b",null,"Probability of Backup Solution being Deployed (without use of DERs)",{"$f":"IF('Bridge to Wires Calculation'!$E$47 = Mappings!$F$6, 1, IF('Bridge to Wires Calculation'!$E$47 = Mappings!$F$4, 'Bridge to Wires Calculation'!$E$56,0))","v":0.1},null,"If weighted average is selected for the Bridge to Wires Calculation, this uses the user-input weighting. Otherwise applies 100% to the selected counterfactual backup"]
[null,"5b",null,"Battery storage air quality value ($/kW-yr)",{"$f":"E20*8760*E21*E22","v":0},"[2b] * 8760 * [3b] * [4b]"]
[]
[null,7,"Weighted average air quality impacts ($/kW-yr)",null,{"$f":"SUM(E23,E17)","v":107.570376},"[5a] + [5b]"]
[null,"*Only applies to Bridge-to-Wires value"]
[]
[]
[null,"Diesel Generation - Emissions Factors for Uncontrolled Diesel Industrial Engines"]
[]
[]
[null,null,null,"Table 3.3-1: Emissions Factors for Uncontrolled Diesel Industrial Engines","Emission Factor (lb/hp-hr)","Emission Factor (lb/kWh)","Emission Factor (US tons/kWh)"]
[null,null,null,"NOx",3.1E-2,{"$f":"E33*0.7456998714","v":2.3116696013400002E-2},{"$f":"0.0005*F33","v":1.1558348006700002E-5}]
[null,null,null,"SOx",2.0500000000000002E-3,{"$f":"E34*0.7456998714","v":1.5286847363700001E-3},{"$f":"0.0005*F34","v":7.6434236818500003E-7}]
[]
[null,null,null,"COBRA Tool","Emission Factor (US tons/GWh) COBRA Inputs","COBRA Results ($2025/GWh) (High)","Health Impacts ($2025/kWh)","Health Impacts ($2025/kW-yr)"]
[null,null,null,"NOx",{"$f":"G33*1000000","v":11.558348006700003}]
[null,null,null,"SOx",{"$f":"G34*1000000","v":0.76434236818500001}]
[null,null,null,"All Pollutants",null,498011,{"$f":"F39/1000000","v":0.49801099999999998},{"$f":"G39*$E$15","v":119.52264}]
[null,null,null,null,null,"COBRA output"]
{"$rows_left_out":17}
{"sheet":"ICE Calculator Results","index":6,"n_rows":26,"n_cols":20,"rows_kept":26,"cut":false,"hidden":false,"merged":[[15,1,16,1],[15,2,16,2],[15,11,16,11],[15,12,16,12]]}
[]
[null,"ICE Calculator Inputs and Outputs for Value of Lost Load"]
[null,"Users should not edit this tab directly; this is for informational purposes only. Changes to any values on this tab will require re-running the ICE Calculator to determine applicable inputs."]
[]
[null,"EDC Customer Counts",null,null,null,null,null,"Assumed Customer %",null,null,null,"Assumed Statewide Customer Count - ICE Inputs"]
[]
[null,null,"Unitil","National Grid","Eversource","Total EDC",null,"Low","Medium","High",null,"Low","Medium","High"]
[null,"Residential",26386,1210955,1362556,{"$f":"SUM(C8,D8,E8)","v":2599897},null,0.95,{"$f":"F8/$F$10","v":0.86510196795202621},0.7,null,{"$f":"H8*$F8","v":2469902.15},{"$f":"I8*$F8","v":2249176.0111725689},1819927.9]
[null,"Non-Residential",4166,183193,218051,{"$f":"SUM(C9,D9,E9)","v":405410},null,0.05,{"$f":"F9/$F$10","v":0.13489803204797379},0.3,null,{"$f":"H9*$F9","v":20270.5},54689.011172569059,121623]
[null,"Total",{"$f":"SUM(C8:C9)","v":30552},{"$f":"SUM(D8:D9)","v":1394148},1580607,{"$f":"SUM(C10:E10)","v":3005307},null,{"$f":"SUM(H8:H9)","v":1},{"$f":"SUM(I8:I9)","v":1},{"$f":"SUM(J8:J9)","v":1},null,3005307,3005307,3005307]
[null,"Non-Residential includes both Commercial and Industrial customers"]
[]
[]
[null,"ICE Calculator 2.0 Outputs - EDC Specific",null,null,null,null,null,null,null,null,null,"ICE Calculator 2.0 Outputs - Statewide"]
[]
[null,"EDC","Sector",null,null,null,null,null,null,null,null,"Value Range","Sector"]
[null,null,null,"No. of Customers","Cost Per Event (2025 $)","Cost Per Average kW (2025 $)","Cost Per Unserved kWh (2025 $)","Minute Interrupted (2025$)","Annual Cost (2025$)","Total Cost of Sustained Interruptions (2025 $)",null,null,null,"No. of Customers","Cost Per Event (2025 $)","Cost Per Average kW (2025 $)","Cost Per Unserved kWh (2025 $)","Minute Interrupted (2025$)","Annual Cost (2025$)","Total Cost of Sustained Interruptions (2025 $)"]
[null,"Eversource","Residential",1362556,36.51,46.524232111692847,3.876134380453752,5.3097731239092498E-2,36.51,49749311.623411864,null,"Low","Residential",2469902,36.51,46.524232111692847,3.876134380453752,5.3097731239092498E-2,36.51,90180458.097547993]
[null,"Eversource","Non-Residential",218051,7416.1707417102971,991.06915357766138,82.588211169284463,10.300959860383943,7416.1707417102971,1617103366.308054,null,"Low","Non-Residential",20271,7416.1707417102971,991.06915357766138,82.588211169284463,10.300959860383943,7416.1707417102971,150333189.66090748]
[null,"Eversource","All Customers",1580607,1054.5634205933682,176.82606457242582,14.739930191972077,1.4654973821989528,1054.5634205933682,1666852677.9208462,null,"Low","All Customers",2490173,96.584773123909244,54.212783595113436,4.5133071553228623,0.1380541012216405,96.584773123909244,240513647.75845549]
[null,"National Grid","Residential",1210955,36.51,46.524232111692847,3.876134380453752,5.3097731239092498E-2,36.51,44214092.966343805,null,"Medium","Residential",2249176,36.51,46.524232111692847,3.876134380453752,5.3097731239092498E-2,36.51,82121364.340924948]
[null,"National Grid","Non-Residential",183193,7416.1707417102971,991.06915357766138,82.588211169284463,10.300959860383943,7416.1707417102971,1358590499.3900697,null,"Medium","Non-Residential",54689,7416.1707417102971,991.06915357766138,82.588211169284463,10.300959860383943,7416.1707417102971,405582941.60121292]
[null,"National Grid","All Customers",1394148,1006.2126265270506,170.64548865619545,14.21957242582897,1.401780104712042,1006.2126265270506,1402804592.3564134,null,"Medium","All Customers",2303865,211.69003490401397,68.952713787085514,5.7451745200698081,0.29734729493891798,211.69003490401397,487704305.94213784]
[null,"Unitil","Residential",26386,36.51,46.524232111692847,3.876134380453752,5.3097731239092498E-2,36.51,963399.18246073299,null,"High","Residential",1819928,36.51,46.524232111692847,3.876134380453752,5.3097731239092498E-2,36.51,66448766.287303664]
[null,"Unitil","Non-Residential",4166,7416.1707417102971,991.06915357766138,82.588211169284463,10.300959860383943,7416.1707417102971,30895765.780750435,null,"High","Non-Residential",121623,7416.1707417102971,991.06915357766138,82.588211169284463,10.300959860383943,7416.1707417102971,901976889.44260025]
[null,"Unitil","All Customers",30552,1042.7863438045376,175.31808900523561,14.612495636998254,1.444258289703316,1042.7863438045376,31859164.963211168,null,"High","All Customers",1941551,498.78946771378708,105.69634380453752,8.8036038394415339,0.6902705061082024,498.78946771378708,968425655.72990394]

{"sheet":"Reference Utility Data","index":7,"n_rows":10,"n_cols":5,"rows_kept":10,"cut":false,"hidden":false,"merged":[[1,3,1,4]]}
[]
[null,null,"Electricity Sales","Line Loss"]
[null,null,"Total Sales MWh)","Average Technical Line Loss","Marginal Line Loss*"]
[null,"EDC Average",{"$f":"AVERAGE(C5:C7)","v":8128978.333333333},{"$f":"SUMPRODUCT($C$5:$C$7, D$5:D$7)/SUM($C$5:$C$7)","v":6.5135940363149375E-2},{"$f":"SUMPRODUCT($C$5:$C$7, E$5:E$7)/SUM($C$5:$C$7)","v":9.7703910544724035E-2}]
[null,"Unitil",431532,3.3300000000000003E-2,{"$f":"D5*(1.5)","v":4.9950000000000008E-2}]
[null,"Eversource",22584860,6.5000000000000002E-2,{"$f":"D6*(1.5)","v":9.7500000000000003E-2}]
[null,"National Grid (combined)",1370543,{"$f":"AVERAGE(D8:D9)","v":7.7399999999999997E-2},{"$f":"D7*(1.5)","v":0.11609999999999999}]
[null,"National Grid: Massachusetts Electric Co.",1356226,6.9699999999999998E-2]
[null,"National Grid: Nantucket Electric Co.",14317,8.5099999999999995E-2]
[null,null,"*sourced from EIA Form 816, year 2023",null,"*calculated as Average Technical Line Loss x 1.5"]

{"sheet":"Mappings","index":8,"n_rows":13,"n_cols":11,"rows_kept":13,"cut":false,"hidden":false,"merged":[]}
[]
[]
[null,"Valuation","EDCs","Deferral Value Selection","B2W Value Selection","B2W Calculation Selection","Diesel Generator Emissions Factor Selection","Capacity Selection","Compensation Selection","Yes/No"]
[null,"Deferral","Eversource","User Input","High","Weighted Average of Avoided Backup Solutions","Uncontrolled Diesel Industrial Engines","MW needed","% of compensation","Yes",1]
[null,"Bridge-to-Wires","National Grid","Example 1","Medium","Avoided Backup Diesel Generator","Large Stationary Diesel Engines","Technology Enrolled","Fixed value","No",2]
[null,null,"Unitil","Example 2","Low","Avoided Backup Energy Storage",null,null,null,null,3]
[null,null,null,"Example 3",null,"Value of Load",null,null,null,null,4]
[null,null,null,null,null,null,null,null,null,null,5]
[null,null,null,null,null,null,null,null,null,null,6]
[null,null,null,null,null,null,null,null,null,null,7]
[null,null,null,null,null,null,null,null,null,null,8]
[null,null,null,null,null,null,null,null,null,null,9]
[null,null,null,null,null,null,null,null,null,null,10]